{"text_format":"1","workbook":"xlsx","n_sheets":18,"sheets":["Deckblatt (S.1)","Infos Händler (S.2)","Infos Verarbeiter (S.2)","DuraPatina (Lager - S.3)","DuraPatina (Kom T1 - S.4)","DuraPatina (Kom T2 - S.5)","DuraAkzent (S.6)","DuraNatur (S.7)","Rombofix (S.8)","EcoGrau (S.9)","CapeCod (S.10)","CapeCod-Lagerprogramm (S.11)","Zubehör (S.12)","Endblatt (S.13)","Übersetzung","Änd. nächste Preisliste","MargenVersionen","Qualitätskriterien"],"not_rendered":{"charts":0,"images":98,"macros":1,"external_links":1,"defined_names":26,"comments":0,"pivot_tables":0},"unopened":[],"bounds":{"document_bytes":16777216,"sheet_cells":100000,"rows_first":2000,"rows_last":500,"rows_between":2000,"halvings":0,"cell_chars":16384,"cell_head_chars":4096},"cells_cut":0,"cells_raw":0,"read":"whole","date_system":"1900"}

{"sheet":"Deckblatt (S.1)","index":0,"n_rows":44,"n_cols":11,"rows_kept":44,"cut":false,"hidden":false,"merged":[]}
[]
[]
[]
[]
[]
[]
{"$rows_left_out":39}
{"sheet":"Infos Händler (S.2)","index":1,"n_rows":47,"n_cols":12,"rows_kept":47,"cut":false,"hidden":false,"merged":[[1,2,3,4],[6,0,6,6],[20,0,20,6],[38,0,38,6],[23,0,23,6],[26,0,26,6],[30,0,30,6],[33,0,33,6],[36,0,36,6],[27,0,27,6],[22,0,22,6]]}
[null,null,null,null,null,null,null,null,null,"a",null,"d"]
[null,null,{"$f":"IF($J$1=\"a\",(IF($L$1=\"D\",VLOOKUP(48,Übersetzung!$A$2:$D$100,2),IF($L$1=\"F\",VLOOKUP(48,Übersetzung!$A$2:$D$100,3),VLOOKUP(48,Übersetzung!$A$2:$D$100,4)))),(IF($L$1=\"D\",VLOOKUP(125,Übersetzung!$A$2:$D$150,2),IF($L$1=\"F\",VLOOKUP(125,Übersetzung!$A$2:$D$150,3),VLOOKUP(125,Übersetzung!$A$2:$D$150,4)))))","v":"Händlerpreisliste 2018"}]
[]
[]
[]
[]
{"$rows_left_out":42}
{"sheet":"Infos Verarbeiter (S.2)","index":2,"n_rows":52,"n_cols":12,"rows_kept":52,"cut":false,"hidden":false,"merged":[[1,2,3,4],[37,0,37,6],[40,0,40,6],[42,0,42,6],[7,0,7,6],[25,0,25,6],[28,0,28,6],[31,0,31,6],[34,0,34,6]]}
[null,null,null,null,null,null,null,null,null,"b",null,"n"]
[null,null,{"$f":"IF($J$1=\"a\",(IF($L$1=\"D\",VLOOKUP(48,Übersetzung!$A$2:$D$100,2),IF($L$1=\"F\",VLOOKUP(48,Übersetzung!$A$2:$D$100,3),VLOOKUP(48,Übersetzung!$A$2:$D$100,4)))),(IF($L$1=\"D\",VLOOKUP(125,Übersetzung!$A$2:$D$150,2),IF($L$1=\"F\",VLOOKUP(125,Übersetzung!$A$2:$D$150,3),VLOOKUP(125,Übersetzung!$A$2:$D$150,4)))))","v":"Prijslijst aannemers 2018"}]
[]
[]
[]
[]
{"$rows_left_out":47}
{"sheet":"DuraPatina (Lager - S.3)","index":3,"n_rows":61,"n_cols":20,"rows_kept":61,"cut":false,"hidden":false,"merged":[[12,16,13,16],[12,17,13,17],[12,18,13,18],[12,19,13,19],[3,11,3,14],[3,16,3,19],[4,16,4,19],[6,16,6,19],[12,6,13,6],[10,4,11,4],[10,3,11,3],[4,11,4,14],[5,0,5,7],[6,11,6,14],[7,0,8,0],[7,4,9,4],[12,7,13,7],[12,11,13,11],[12,12,13,12],[12,13,13,13],[12,14,13,14],[20,0,20,4],[14,18,15,18],[14,19,15,19],[14,4,15,4],[14,2,15,2],[14,3,15,3],[14,7,15,7],[14,1,15,1],[14,6,15,6],[14,5,15,5],[14,16,15,16],[14,17,15,17],[14,11,15,11],[14,12,15,12],[14,13,15,13],[14,14,15,14],[1,1,2,5],[18,0,18,4],[19,0,19,4],[10,1,11,1],[12,1,13,1],[16,0,16,4],[12,4,13,4],[12,2,13,2],[12,3,13,3],[12,5,13,5]]}
[null,null,null,null,null,null,null,null,null,"a",null,"d"]
[null,{"$f":"IF($J$1=\"a\",(IF($L$1=\"D\",VLOOKUP(48,Übersetzung!$A$2:$D$100,2),IF($L$1=\"F\",VLOOKUP(48,Übersetzung!$A$2:$D$100,3),VLOOKUP(48,Übersetzung!$A$2:$D$100,4)))),(IF($L$1=\"D\",VLOOKUP(125,Übersetzung!$A$2:$D$150,2),IF($L$1=\"F\",VLOOKUP(125,Übersetzung!$A$2:$D$150,3),VLOOKUP(125,Übersetzung!$A$2:$D$150,4)))))","v":"Händlerpreisliste 2018"}]
[]
[null,null,null,null,null,null,null,null,null,null,null,"Leithändlerpreise 02/2018",null,null,null,null,"Umrechnung auf Nutzfläche (wo nötig)"]
[null,null,null,null,null,null,null,null,null,null,null,"Leithändlerpreise 01/2013",null,null,null,null,"Leithändlerpreise 01/2013"]
[{"$f":"IF($L$1=\"D\",VLOOKUP(25,Übersetzung!$A$2:$D$100,2),IF($L$1=\"F\",VLOOKUP(25,Übersetzung!$A$2:$D$100,3),VLOOKUP(25,Übersetzung!$A$2:$D$100,4)))","v":"LAGERWARE (nur in den Farbtönen - Kristallgrau / Lavagrau / Gletschergrau)\n- Bei der Qualität \"Selekt\" sind Verschnittlängen (200/250/300/350 cm) bis 10 % mitgehend!\n- Für Lieferungen ohne Kurzlängen berechnen wir 7% Aufpreis. \n- Bitte bei Bestellung angeben, ob Bestellmenge zzgl. oder inkl. Verschnitt ist.\n  Wenn Sie nichts angeben, liefern wir inkl. Verschnittlängen.\n- Lieferzeit: ca. 2 Wochen (Genaue Lieferzeit auf Anfrage!)"},null,null,null,null,null,null,null,null,null,"Marge W&R auf EK Habis","Kommisions- Preis","Anbruch-Preis ab 1 Paket","Paketpreis","6 Pakete",null,"Kommisions- Preis","Anbruch-preis ab 1 Paket","Paketpreis","6 Pakete"]
{"$rows_left_out":56}
{"sheet":"DuraPatina (Kom T1 - S.4)","index":4,"n_rows":53,"n_cols":19,"rows_kept":53,"cut":false,"hidden":false,"merged":[[6,0,6,7],[22,4,24,4],[22,10,24,10],[39,4,40,4],[12,12,14,12],[39,7,40,7],[36,0,36,7],[12,3,14,3],[22,3,24,3],[12,6,14,6],[22,6,24,6],[30,0,30,7],[28,0,28,1],[28,4,28,7],[22,7,24,7],[12,7,14,7],[3,10,3,13],[3,15,3,18],[7,15,7,18],[4,12,4,15],[4,17,4,20],[5,15,5,18],[32,0,32,7],[33,0,33,7],[34,0,34,7],[39,1,40,1],[39,2,40,2],[39,3,40,3],[39,5,40,5],[39,6,40,6],[39,11,40,11],[39,12,40,12],[39,13,40,13],[12,15,14,15],[12,13,14,13],[41,0,41,4],[1,1,2,5],[12,16,14,16],[12,17,14,17],[22,11,24,11],[22,12,24,12],[12,4,14,4],[7,10,7,13],[22,13,24,13],[12,10,14,10],[12,11,14,11],[8,0,27,0],[8,1,27,1],[5,0,5,7],[5,10,5,13],[39,10,40,10],[12,18,14,18],[22,15,24,15],[22,16,24,16],[22,17,24,17],[22,18,24,18]]}
[null,null,null,null,null,null,null,null,null,"a",null,"d"]
[null,{"$f":"IF($J$1=\"a\",(IF($L$1=\"D\",VLOOKUP(48,Übersetzung!$A$2:$D$100,2),IF($L$1=\"F\",VLOOKUP(48,Übersetzung!$A$2:$D$100,3),VLOOKUP(48,Übersetzung!$A$2:$D$100,4)))),(IF($L$1=\"D\",VLOOKUP(125,Übersetzung!$A$2:$D$150,2),IF($L$1=\"F\",VLOOKUP(125,Übersetzung!$A$2:$D$150,3),VLOOKUP(125,Übersetzung!$A$2:$D$150,4)))))","v":"Händlerpreisliste 2018"}]
[]
[null,null,null,null,null,null,null,null,null,null,"Leithändlerpreise 02/2018",null,null,null,null,"Umrechnung auf Nutzfläche (wo nötig)"]
[null,null,null,null,null,null,null,null,null,null,null,null,"Leithändlerpreise 01/2013",null,null,null,null,"Leithändlerpreise 01/2013"]
[{"$f":"IF($L$1=\"D\",VLOOKUP(193,Übersetzung!$A$2:$D$301,2),IF($L$1=\"F\",VLOOKUP(193,Übersetzung!$A$2:$D$301,3),VLOOKUP(193,Übersetzung!$A$2:$D$301,4)))","v":"KOMMISSIONSWARE"}]
{"$rows_left_out":48}
{"sheet":"DuraPatina (Kom T2 - S.5)","index":5,"n_rows":61,"n_cols":12,"rows_kept":61,"cut":false,"hidden":false,"merged":[[37,0,37,7],[47,5,47,7],[9,0,9,7],[35,0,35,7],[1,1,2,5],[3,10,3,13],[3,15,3,18],[4,12,4,15],[4,17,4,20],[6,0,6,7],[5,0,5,7]]}
[null,null,null,null,null,null,null,null,null,"a",null,"n"]
[null,{"$f":"IF($J$1=\"a\",(IF($L$1=\"D\",VLOOKUP(48,Übersetzung!$A$2:$D$100,2),IF($L$1=\"F\",VLOOKUP(48,Übersetzung!$A$2:$D$100,3),VLOOKUP(48,Übersetzung!$A$2:$D$100,4)))),(IF($L$1=\"D\",VLOOKUP(125,Übersetzung!$A$2:$D$150,2),IF($L$1=\"F\",VLOOKUP(125,Übersetzung!$A$2:$D$150,3),VLOOKUP(125,Übersetzung!$A$2:$D$150,4)))))","v":"Prijslijst handelaars 2018"}]
[]
[]
[]
[{"$f":"IF($L$1=\"D\",VLOOKUP(194,Übersetzung!$A$2:$D$301,2),IF($L$1=\"F\",VLOOKUP(194,Übersetzung!$A$2:$D$301,3),VLOOKUP(194,Übersetzung!$A$2:$D$301,4)))","v":"OP BESTELLING BESCHIKBAAR (voortzetting)"}]
{"$rows_left_out":56}
{"sheet":"DuraAkzent (S.6)","index":6,"n_rows":59,"n_cols":19,"rows_kept":59,"cut":false,"hidden":false,"merged":[[37,11,38,11],[37,12,38,12],[3,15,3,18],[37,15,38,15],[37,16,38,16],[37,17,38,17],[37,18,38,18],[22,18,24,18],[7,15,7,18],[37,13,38,13],[22,13,24,13],[22,15,24,15],[22,16,24,16],[22,17,24,17],[22,11,24,11],[22,12,24,12],[37,6,38,6],[37,7,38,7],[39,0,39,4],[37,9,38,9],[37,10,38,10],[28,0,28,1],[28,4,28,7],[30,0,30,7],[3,9,3,13],[4,11,4,14],[22,3,24,3],[22,4,24,4],[12,3,14,3],[22,6,24,6],[22,7,24,7],[22,10,24,10],[4,16,4,19],[12,4,14,4],[12,13,14,13],[12,15,14,15],[12,16,14,16],[12,17,14,17],[12,18,14,18],[12,6,14,6],[12,7,14,7],[12,11,14,11],[12,12,14,12],[5,10,5,13],[5,15,5,18],[7,10,7,13],[12,10,14,10],[40,0,40,4],[41,0,41,4],[8,0,27,0],[8,1,27,1],[1,1,2,4],[6,0,6,7],[5,0,5,7],[31,0,31,7],[32,0,32,7],[33,0,33,7],[35,0,35,7],[37,1,38,1],[37,2,38,2],[37,3,38,3],[37,4,38,4],[37,5,38,5]]}
[null,null,null,null,null,null,null,null,null,"a",null,"d"]
[null,{"$f":"\"          \" & IF($J$1=\"a\",(IF($L$1=\"D\",VLOOKUP(48,Übersetzung!$A$2:$D$100,2),IF($L$1=\"F\",VLOOKUP(48,Übersetzung!$A$2:$D$100,3),VLOOKUP(48,Übersetzung!$A$2:$D$100,4)))),(IF($L$1=\"D\",VLOOKUP(125,Übersetzung!$A$2:$D$150,2),IF($L$1=\"F\",VLOOKUP(125,Übersetzung!$A$2:$D$150,3),VLOOKUP(125,Übersetzung!$A$2:$D$150,4)))))","v":"          Händlerpreisliste 2018"}]
[]
[null,null,null,null,null,null,null,null,null,"Leithändlerpreise 02/2018",null,null,null,null,null,"Umrechnung auf Nutzfläche (wo nötig)"]
[null,null,null,null,null,null,null,null,null,null,null,"Leithändlerpreise 01/2013",null,null,null,null,"Leithändlerpreise 01/2013"]
[{"$f":"IF($L$1=\"D\",VLOOKUP(193,Übersetzung!$A$2:$D$301,2),IF($L$1=\"F\",VLOOKUP(193,Übersetzung!$A$2:$D$301,3),VLOOKUP(193,Übersetzung!$A$2:$D$301,4)))","v":"KOMMISSIONSWARE"}]
{"$rows_left_out":54}
{"sheet":"DuraNatur (S.7)","index":7,"n_rows":56,"n_cols":19,"rows_kept":56,"cut":false,"hidden":false,"merged":[[22,10,24,10],[22,11,24,11],[22,12,24,12],[22,13,24,13],[28,0,28,1],[28,4,28,7],[12,17,14,17],[12,18,14,18],[34,0,34,7],[36,0,36,7],[39,9,40,9],[39,10,40,10],[39,15,40,15],[39,7,40,7],[39,6,40,6],[39,11,40,11],[30,0,30,7],[32,0,32,7],[33,0,33,7],[22,3,24,3],[22,4,24,4],[22,6,24,6],[12,11,14,11],[12,12,14,12],[12,13,14,13],[12,15,14,15],[12,16,14,16],[39,16,40,16],[39,17,40,17],[39,18,40,18],[22,15,24,15],[1,2,2,6],[6,0,6,7],[2,8,3,8],[3,15,3,18],[4,11,4,14],[4,16,4,19],[5,10,5,13],[5,15,5,18],[3,10,3,13],[12,6,14,6],[12,7,14,7],[12,10,14,10],[5,0,5,7],[39,1,40,1],[22,16,24,16],[41,0,42,4],[41,5,42,5],[39,4,40,4],[39,3,40,3],[39,2,40,2],[7,10,7,13],[7,15,7,18],[12,3,14,3],[12,4,14,4],[22,17,24,17],[22,18,24,18],[39,13,40,13],[39,12,40,12],[44,9,45,9],[8,0,27,0],[8,1,27,1],[45,0,45,4],[39,5,40,5],[44,0,44,4],[43,0,43,4],[22,7,24,7]]}
[null,null,null,null,null,null,null,null,null,"a",null,"n"]
[null,null,{"$f":"IF($J$1=\"a\",(IF($L$1=\"D\",VLOOKUP(48,Übersetzung!$A$2:$D$100,2),IF($L$1=\"F\",VLOOKUP(48,Übersetzung!$A$2:$D$100,3),VLOOKUP(48,Übersetzung!$A$2:$D$100,4)))),(IF($L$1=\"D\",VLOOKUP(125,Übersetzung!$A$2:$D$150,2),IF($L$1=\"F\",VLOOKUP(125,Übersetzung!$A$2:$D$150,3),VLOOKUP(125,Übersetzung!$A$2:$D$150,4)))))","v":"Prijslijst handelaars 2018"},{"$f":"IF($L$1=\"D\",VLOOKUP(3,Übersetzung!$A$2:$D$100,2),IF($L$1=\"F\",VLOOKUP(3,Übersetzung!$A$2:$D$100,3),VLOOKUP(3,Übersetzung!$A$2:$D$100,4)))","v":"Lengte\n(m)"},{"$f":"IF($L$1=\"D\",VLOOKUP(3,Übersetzung!$A$2:$D$100,2),IF($L$1=\"F\",VLOOKUP(3,Übersetzung!$A$2:$D$100,3),VLOOKUP(3,Übersetzung!$A$2:$D$100,4)))","v":"Lengte\n(m)"},null,{"$f":"IF($L$1=\"D\",VLOOKUP(3,Übersetzung!$A$2:$D$100,2),IF($L$1=\"F\",VLOOKUP(3,Übersetzung!$A$2:$D$100,3),VLOOKUP(3,Übersetzung!$A$2:$D$100,4)))","v":"Lengte\n(m)"}]
[null,null,{"$f":"IF($L$1=\"D\",VLOOKUP(3,Übersetzung!$A$2:$D$100,2),IF($L$1=\"F\",VLOOKUP(3,Übersetzung!$A$2:$D$100,3),VLOOKUP(3,Übersetzung!$A$2:$D$100,4)))","v":"Lengte\n(m)"},{"$f":"IF($L$1=\"D\",VLOOKUP(3,Übersetzung!$A$2:$D$100,2),IF($L$1=\"F\",VLOOKUP(3,Übersetzung!$A$2:$D$100,3),VLOOKUP(3,Übersetzung!$A$2:$D$100,4)))","v":"Lengte\n(m)"},{"$f":"IF($L$1=\"D\",VLOOKUP(3,Übersetzung!$A$2:$D$100,2),IF($L$1=\"F\",VLOOKUP(3,Übersetzung!$A$2:$D$100,3),VLOOKUP(3,Übersetzung!$A$2:$D$100,4)))","v":"Lengte\n(m)"},null,{"$f":"IF($L$1=\"D\",VLOOKUP(3,Übersetzung!$A$2:$D$100,2),IF($L$1=\"F\",VLOOKUP(3,Übersetzung!$A$2:$D$100,3),VLOOKUP(3,Übersetzung!$A$2:$D$100,4)))","v":"Lengte\n(m)"}]
[null,null,null,null,null,null,null,null,null,null,"Leithändlerpreise 03/2016",null,null,null,null,"Umrechnung auf Nutzfläche (wo nötig)"]
[null,null,null,null,null,null,null,null,null,null,null,"Leithändlerpreise 01/2013",null,null,null,null,"Leithändlerpreise 01/2013"]
[{"$f":"IF($L$1=\"D\",VLOOKUP(193,Übersetzung!$A$2:$D$301,2),IF($L$1=\"F\",VLOOKUP(193,Übersetzung!$A$2:$D$301,3),VLOOKUP(193,Übersetzung!$A$2:$D$301,4)))","v":"OP BESTELLING BESCHIKBAAR"}]
{"$rows_left_out":51}
{"sheet":"Rombofix (S.8)","index":8,"n_rows":59,"n_cols":12,"rows_kept":59,"cut":false,"hidden":false,"merged":[[1,1,2,4],[19,0,19,5],[17,0,17,5],[3,10,3,11],[14,10,14,11],[12,0,12,5],[9,0,9,5],[13,0,13,5],[15,0,15,1],[16,0,16,1],[15,2,15,3],[15,4,15,5],[16,2,16,3],[16,4,16,5]]}
[null,null,null,null,null,null,null,null,null,"a",null,"d"]
[null,{"$f":"\"                 \" & IF($J$1=\"a\",(IF($L$1=\"D\",VLOOKUP(48,Übersetzung!$A$2:$D$100,2),IF($L$1=\"F\",VLOOKUP(48,Übersetzung!$A$2:$D$100,3),VLOOKUP(48,Übersetzung!$A$2:$D$100,4)))),(IF($L$1=\"D\",VLOOKUP(125,Übersetzung!$A$2:$D$150,2),IF($L$1=\"F\",VLOOKUP(125,Übersetzung!$A$2:$D$150,3),VLOOKUP(125,Übersetzung!$A$2:$D$150,4)))))","v":"                 Händlerpreisliste 2018"}]
[]
[]
[]
[]
{"$rows_left_out":54}
{"sheet":"EcoGrau (S.9)","index":9,"n_rows":59,"n_cols":20,"rows_kept":59,"cut":false,"hidden":false,"merged":[[4,0,4,7],[44,0,44,1],[44,4,44,7],[28,14,30,14],[38,14,40,14],[22,0,22,7],[38,19,40,19],[28,19,30,19],[28,3,30,3],[28,4,30,4],[28,6,30,6],[28,7,30,7],[28,11,30,11],[28,12,30,12],[28,13,30,13],[28,16,30,16],[28,17,30,17],[28,18,30,18],[38,3,40,3],[38,4,40,4],[38,6,40,6],[38,7,40,7],[16,19,17,19],[18,19,19,19],[38,17,40,17],[16,17,17,17],[16,18,17,18],[18,16,19,16],[18,17,19,17],[18,18,19,18],[20,0,21,4],[18,3,19,3],[18,11,19,11],[18,12,19,12],[20,5,21,5],[18,13,19,13],[18,14,19,14],[38,18,40,18],[16,16,17,16],[16,3,17,3],[16,11,17,11],[16,12,17,12],[16,13,17,13],[16,14,17,14],[16,6,17,6],[46,0,46,7],[47,0,47,7],[38,11,40,11],[38,12,40,12],[38,13,40,13],[38,16,40,16],[14,12,15,12],[14,13,15,13],[14,14,15,14],[18,7,19,7],[18,6,19,6],[18,5,19,5],[18,4,19,4],[16,7,17,7],[14,16,15,16],[14,4,15,4],[14,5,15,5],[14,6,15,6],[14,7,15,7],[10,2,11,2],[10,5,11,5],[10,6,11,6],[10,7,11,7],[10,11,11,11],[10,12,11,12],[10,13,11,13],[10,14,11,14],[12,1,13,1],[12,2,13,2],[12,3,13,3],[12,4,13,4],[12,5,13,5],[12,6,13,6],[12,7,13,7],[12,11,13,11],[12,12,13,12],[10,1,11,1],[8,7,9,7],[8,11,9,11],[8,12,9,12],[8,13,9,13],[8,14,9,14],[6,11,6,14],[6,16,6,19],[8,5,9,5],[8,6,9,6],[3,11,3,14],[3,16,3,19],[4,11,4,14],[4,16,4,19],[14,17,15,17],[14,18,15,18],[14,19,15,19],[12,13,13,13],[12,14,13,14],[12,16,13,16],[12,17,13,17],[12,18,13,18],[12,19,13,19],[14,11,15,11],[52,0,52,5],[51,0,51,5],[50,0,50,7],[24,0,43,0],[24,1,43,1],[1,0,2,0],[10,3,11,3],[10,4,11,4],[8,1,9,1],[8,2,9,2],[8,3,9,3],[8,4,9,4],[18,1,19,1],[1,1,2,5],[5,0,5,7],[16,4,17,4],[16,1,17,1],[16,2,17,2],[16,5,17,5],[7,0,7,7],[14,1,15,1],[14,2,15,2],[14,3,15,3],[18,2,19,2]]}
[null,null,null,null,null,null,null,null,"a",null,null,"d"]
[null,{"$f":"IF($I$1=\"a\",(IF($L$1=\"D\",VLOOKUP(48,Übersetzung!$A$2:$D$100,2),IF($L$1=\"F\",VLOOKUP(48,Übersetzung!$A$2:$D$100,3),VLOOKUP(48,Übersetzung!$A$2:$D$100,4)))),(IF($L$1=\"D\",VLOOKUP(125,Übersetzung!$A$2:$D$150,2),IF($L$1=\"F\",VLOOKUP(125,Übersetzung!$A$2:$D$150,3),VLOOKUP(125,Übersetzung!$A$2:$D$150,4)))))","v":"Händlerpreisliste 2018"}]
[]
[null,null,null,null,null,null,null,null,null,null,null,"Leithändlerpreise 02/2018",null,null,null,null,"Umrechnung auf Nutzfläche (wo nötig)"]
[{"$f":"IF($L$1=\"D\",VLOOKUP(193,Übersetzung!$A$2:$D$301,2),IF($L$1=\"F\",VLOOKUP(193,Übersetzung!$A$2:$D$301,3),VLOOKUP(193,Übersetzung!$A$2:$D$301,4)))","v":"KOMMISSIONSWARE"},null,null,null,null,null,null,null,null,null,null,"Leithändlerpreise 01/2013",null,null,null,null,"Leithändlerpreise 01/2013"]
[{"$f":"IF($L$1=\"D\",VLOOKUP(133,Übersetzung!$A$2:$D$201,2),IF($L$1=\"F\",VLOOKUP(133,Übersetzung!$A$2:$D$201,3),VLOOKUP(133,Übersetzung!$A$2:$D$201,4)))","v":"- Produktion ab 50m² (kleinere Mengen nur als Sammelauftrag möglich - Achtung: evt. längere Lieferzeit!).\n- Mindermengenzuschlag bis 100m² - Farbtöne Kristall, Lava & Gletscher: 55,- €.\n- Mindermengenzuschlag bis 100m² - Farbtöne Basalt, Tundra & Schiefer: 170,- €.\n- Verschnittlängen (200/250/300/350 cm) bis 10% mitgehend!\n- Für Lieferungen ohne Kurzlängen berechnen wir 7% Aufpreis. \n- Bitte bei Bestellung angeben, ob Bestellmenge zzgl. oder inkl. Verschnitt ist. \n  Wenn Sie nichts angeben, liefern wir inkl. Verschnittlängen!\n- Lieferzeit: 6 - 8 Wochen (Genaue Lieferzeit auf Anfrage!)."},null,null,null,null,null,null,null,null,null,"Marge W&R auf EK Habis","Kommisions- Preis","Anbruch-Preis ab 1 Paket","Paketpreis","6 Pakete",null,"Kommisions- Preis","Anbruch-preis ab 1 Paket","Paketpreis","6 Pakete"]
{"$rows_left_out":54}
{"sheet":"CapeCod (S.10)","index":10,"n_rows":73,"n_cols":18,"rows_kept":73,"cut":false,"hidden":false,"merged":[[47,0,47,5],[1,1,2,3],[5,3,6,3],[10,3,11,3],[14,3,15,3],[7,3,8,3],[12,3,13,3],[16,3,17,3],[18,0,19,2],[18,3,19,3],[14,5,15,5],[16,5,17,5],[16,4,17,4],[16,2,17,2],[10,1,11,1],[7,1,8,1],[12,5,13,5],[12,4,13,4],[12,2,13,2],[12,1,13,1],[7,5,8,5],[7,4,8,4],[7,2,8,2],[46,0,46,5],[29,0,29,5],[31,0,31,5],[32,0,33,0],[34,0,34,5],[35,0,36,0],[37,0,37,5],[44,0,44,5],[5,5,6,5],[5,4,6,4],[5,2,6,2],[5,1,6,1],[42,0,42,2],[25,0,26,0],[9,0,10,0],[38,0,40,0],[41,0,41,5],[16,1,17,1],[14,1,15,1],[14,2,15,2],[14,4,15,4],[10,5,11,5],[10,4,11,4],[10,2,11,2],[1,8,1,11],[1,14,1,17],[2,14,3,17],[16,17,17,17],[16,16,17,16],[16,15,17,15],[16,14,17,14],[14,14,15,14],[14,15,15,15],[14,16,15,16],[14,17,15,17],[16,9,17,9],[16,10,17,10],[16,11,17,11],[14,11,15,11],[14,10,15,10],[14,9,15,9],[16,8,17,8],[14,8,15,8],[12,16,13,16],[12,17,13,17],[10,14,11,14],[10,15,11,15],[10,16,11,16],[12,14,13,14],[12,15,13,15],[7,11,8,11],[7,10,8,10],[5,8,6,8],[5,9,6,9],[5,10,6,10],[5,11,6,11],[7,14,8,14],[7,15,8,15],[12,8,13,8],[12,9,13,9],[12,10,13,10],[12,11,13,11],[7,9,8,9],[7,8,8,8],[10,11,11,11],[10,8,11,8],[10,9,11,9],[10,10,11,10],[10,17,11,17],[5,15,6,15],[5,16,6,16],[5,17,6,17],[5,14,6,14],[7,16,8,16],[7,17,8,17],[2,6,3,6],[2,7,3,7],[2,8,3,11]]}
[null,null,null,null,null,null,null,null,"a",null,null,"d"]
[null,{"$f":"IF($I$1=\"a\",(IF($L$1=\"D\",VLOOKUP(48,Übersetzung!$A$2:$D$100,2),IF($L$1=\"F\",VLOOKUP(48,Übersetzung!$A$2:$D$100,3),VLOOKUP(48,Übersetzung!$A$2:$D$100,4)))),(IF($L$1=\"D\",VLOOKUP(125,Übersetzung!$A$2:$D$150,2),IF($L$1=\"F\",VLOOKUP(125,Übersetzung!$A$2:$D$150,3),VLOOKUP(125,Übersetzung!$A$2:$D$150,4)))))","v":"Händlerpreisliste 2018"},null,null,null,null,null,null,"Leithändlerpreise 02/2018",null,null,null,null,null,"Umrechnung auf Nutzfläche (wo nötig)"]
[null,null,null,null,null,null,null,"Marge W&R auf EK Habis","Hier die Preise eingeben!",null,null,null,null,null,"Felder werden automatisch berechnet!"]
[]
[{"$f":"IF($L$1=\"D\",VLOOKUP(1,Übersetzung!$A$2:$D$100,2),IF($L$1=\"F\",VLOOKUP(1,Übersetzung!$A$2:$D$100,3),VLOOKUP(1,Übersetzung!$A$2:$D$100,4)))","v":"Profile"},{"$f":"IF($L$1=\"D\",VLOOKUP(2,Übersetzung!$A$2:$D$100,2),IF($L$1=\"F\",VLOOKUP(2,Übersetzung!$A$2:$D$100,3),VLOOKUP(2,Übersetzung!$A$2:$D$100,4)))","v":"Dimension in mm Stärke x Breite"},{"$f":"IF($L$1=\"D\",VLOOKUP(4,Übersetzung!$A$2:$D$100,2),IF($L$1=\"F\",VLOOKUP(4,Übersetzung!$A$2:$D$100,3),VLOOKUP(4,Übersetzung!$A$2:$D$100,4)))","v":"VPE Bund/Paket"},{"$f":"IF($L$1=\"D\",VLOOKUP(176,Übersetzung!$A$2:$D$301,2),IF($L$1=\"F\",VLOOKUP(176,Übersetzung!$A$2:$D$301,3),VLOOKUP(176,Übersetzung!$A$2:$D$301,4)))","v":"Bedarf (m/m²)"},{"$f":"IF($L$1=\"D\",VLOOKUP(5,Übersetzung!$A$2:$D$100,2),IF($L$1=\"F\",VLOOKUP(5,Übersetzung!$A$2:$D$100,3),VLOOKUP(5,Übersetzung!$A$2:$D$100,4)))","v":"Kommissions-preis (weniger als ein Paket)"},{"$f":"IF($L$1=\"D\",VLOOKUP(7,Übersetzung!$A$2:$D$100,2),IF($L$1=\"F\",VLOOKUP(7,Übersetzung!$A$2:$D$100,3),VLOOKUP(7,Übersetzung!$A$2:$D$100,4)))","v":"Paketpreis"},null,{"$f":"IF($I$1=\"A\",VLOOKUP(1,MargenVersionen!$A$9:$G$12,2),IF($I$1=\"B\",VLOOKUP(1,MargenVersionen!$A$9:$G$12,4),VLOOKUP(1,MargenVersionen!$A$9:$G$12,6)))","v":0.3},"Kommisions- Preis","Anbruch-preis ab 1 Paket","Paketpreis","6 Pakete",null,null,"Kommisions- Preis","Anbruch-preis ab 1 Paket","Paketpreis","6 Pakete"]
[{"$f":"IF($L$1=\"D\",VLOOKUP(37,Übersetzung!$A$2:$D$100,2),IF($L$1=\"F\",VLOOKUP(37,Übersetzung!$A$2:$D$100,3),VLOOKUP(37,Übersetzung!$A$2:$D$100,4)))","v":"Bevel"},{"$f":"IF($L$1=\"D\",VLOOKUP(93,Übersetzung!$A$2:$D$100,2),IF($L$1=\"F\",VLOOKUP(93,Übersetzung!$A$2:$D$100,3),VLOOKUP(93,Übersetzung!$A$2:$D$100,4)))","v":"24 x 137\nDeckmaß: 124 mm"},"6 / 252",8.07,{"$f":"O6+O6*$H$5","v":38.061693548387098},{"$f":"P6+P6*$H$5","v":36.122701612903228},null,null,26.5,25.15,23.9,21.6,null,null,{"$f":"I6*137/124","v":29.278225806451612},{"$f":"J6*137/124","v":27.786693548387095},26.40564516129032,23.86451612903226]
{"$rows_left_out":68}
{"sheet":"CapeCod-Lagerprogramm (S.11)","index":11,"n_rows":36,"n_cols":16,"rows_kept":36,"cut":false,"hidden":false,"merged":[[14,11,15,11],[14,12,15,12],[30,0,31,0],[26,12,27,12],[28,0,29,0],[28,1,29,1],[28,2,29,2],[28,3,29,3],[28,4,29,4],[28,5,29,5],[28,6,29,6],[28,7,29,7],[28,8,29,8],[26,6,27,6],[26,7,27,7],[26,8,27,8],[26,9,27,9],[26,10,27,10],[26,11,27,11],[28,12,29,12],[28,9,29,9],[28,10,29,10],[28,11,29,11],[24,12,25,12],[26,0,27,0],[26,1,27,1],[26,2,27,2],[26,3,27,3],[26,4,27,4],[26,5,27,5],[20,12,21,12],[22,0,23,0],[22,1,23,1],[22,2,23,2],[22,3,23,3],[22,4,23,4],[22,5,23,5],[22,12,23,12],[24,0,25,0],[24,1,25,1],[24,2,25,2],[24,3,25,3],[24,4,25,4],[24,5,25,5],[24,6,25,6],[24,7,25,7],[24,8,25,8],[22,6,23,6],[22,7,23,7],[22,8,23,8],[22,9,23,9],[22,10,23,10],[22,11,23,11],[24,9,25,9],[20,0,21,0],[20,1,21,1],[20,2,21,2],[20,3,21,3],[20,4,21,4],[20,5,21,5],[20,6,21,6],[20,7,21,7],[20,10,21,10],[20,8,21,8],[20,11,21,11],[24,10,25,10],[24,11,25,11],[16,12,17,12],[18,0,19,0],[18,1,19,1],[18,2,19,2],[18,3,19,3],[18,4,19,4],[18,5,19,5],[18,6,19,6],[18,7,19,7],[18,8,19,8],[16,6,17,6],[16,7,17,7],[16,8,17,8],[16,9,17,9],[16,10,17,10],[16,11,17,11],[18,9,19,9],[18,10,19,10],[18,11,19,11],[18,12,19,12],[10,11,11,11],[10,12,11,12],[12,0,13,0],[10,7,11,7],[10,8,11,8],[10,9,11,9],[10,10,11,10],[12,11,13,11],[12,12,13,12],[12,1,13,1],[12,7,13,7],[12,8,13,8],[12,9,13,9],[12,10,13,10],[10,5,11,5],[10,6,11,6],[12,2,13,2],[12,3,13,3],[12,4,13,4],[12,5,13,5],[12,6,13,6],[14,9,15,9],[14,8,15,8],[14,7,15,7],[20,9,21,9],[2,3,4,7],[10,0,11,0],[10,1,11,1],[10,2,11,2],[10,3,11,3],[10,4,11,4],[14,0,15,0],[16,0,17,0],[16,1,17,1],[16,2,17,2],[16,3,17,3],[16,4,17,4],[16,5,17,5],[14,2,15,2],[14,3,15,3],[14,4,15,4],[14,5,15,5],[14,6,15,6],[14,1,15,1]]}
[null,null,null,null,null,null,null,null,null,null,null,null,null,null,null,"d"]
[]
[null,null,null,{"$f":"IF($P$1=\"D\",VLOOKUP(24,Übersetzung!$A$2:$D$100,2),IF($P$1=\"F\",VLOOKUP(24,Übersetzung!$A$2:$D$100,3),VLOOKUP(24,Übersetzung!$A$2:$D$100,4)))","v":"Lagerware"}]
[]
[]
[]
{"$rows_left_out":31}
{"sheet":"Zubehör (S.12)","index":12,"n_rows":51,"n_cols":13,"rows_kept":51,"cut":false,"hidden":false,"merged":[[1,1,2,5],[50,0,50,1],[10,0,10,5],[12,9,13,9],[5,1,5,2],[6,1,6,2],[7,1,7,2],[8,1,8,2],[9,1,9,2],[11,1,11,2],[12,1,12,2],[39,2,39,3],[39,5,39,6],[13,1,13,2],[15,2,15,3],[15,5,15,6],[27,2,27,3],[27,5,27,6],[3,10,3,11],[4,10,4,11]]}
[null,null,null,null,null,null,null,null,null,null,"a",null,"d"]
[null,{"$f":"\"   \" & IF($K$1=\"a\",(IF($M$1=\"D\",VLOOKUP(48,Übersetzung!$A$2:$D$100,2),IF($M$1=\"F\",VLOOKUP(48,Übersetzung!$A$2:$D$100,3),VLOOKUP(48,Übersetzung!$A$2:$D$100,4)))),(IF($M$1=\"D\",VLOOKUP(125,Übersetzung!$A$2:$D$150,2),IF($M$1=\"F\",VLOOKUP(125,Übersetzung!$A$2:$D$150,3),VLOOKUP(125,Übersetzung!$A$2:$D$150,4)))))","v":"   Händlerpreisliste 2018"}]
[]
[null,null,null,null,null,null,null,null,null,null,"Leithändlerpreise 02/2018"]
[]
[{"$f":"IF($M$1=\"D\",VLOOKUP(122,Übersetzung!$A$2:$D$121,2),IF($M$1=\"F\",VLOOKUP(122,Übersetzung!$A$2:$D$121,3),VLOOKUP(122,Übersetzung!$A$2:$D$121,4)))","v":"Nr."},{"$f":"IF($M$1=\"D\",VLOOKUP(111,Übersetzung!$A$2:$D$110,2),IF($M$1=\"F\",VLOOKUP(111,Übersetzung!$A$2:$D$110,3),VLOOKUP(111,Übersetzung!$A$2:$D$110,4)))","v":"ZUBEHÖR"},null,{"$f":"IF($M$1=\"D\",VLOOKUP(109,Übersetzung!$A$2:$D$108,2),IF($M$1=\"F\",VLOOKUP(109,Übersetzung!$A$2:$D$108,3),VLOOKUP(109,Übersetzung!$A$2:$D$108,4)))","v":"Abmessungen (mm)"},{"$f":"IF($M$1=\"D\",VLOOKUP(3,Übersetzung!$A$2:$D$100,2),IF($M$1=\"F\",VLOOKUP(3,Übersetzung!$A$2:$D$100,3),VLOOKUP(3,Übersetzung!$A$2:$D$100,4)))","v":"Länge\n(m)"},{"$f":"IF($M$1=\"D\",VLOOKUP(110,Übersetzung!$A$2:$D$109,2),IF($M$1=\"F\",VLOOKUP(110,Übersetzung!$A$2:$D$109,3),VLOOKUP(110,Übersetzung!$A$2:$D$109,4)))","v":"Einzelpreis (/m)"},{"$f":"IF($M$1=\"D\",VLOOKUP(177,Übersetzung!$A$2:$D$301,2),IF($M$1=\"F\",VLOOKUP(177,Übersetzung!$A$2:$D$301,3),VLOOKUP(177,Übersetzung!$A$2:$D$301,4)))","v":"Einzelpreis (ab 60 lfm)"},null,null,"Marge W&R auf EK Habis","Einzelpreis","Paketpreis"]
{"$rows_left_out":46}
{"sheet":"Endblatt (S.13)","index":13,"n_rows":44,"n_cols":11,"rows_kept":44,"cut":false,"hidden":false,"merged":[]}
[]
[]
[]
[]
[]
[]
{"$rows_left_out":39}
{"sheet":"Übersetzung","index":14,"n_rows":206,"n_cols":5,"rows_kept":206,"cut":false,"hidden":false,"merged":[]}
[null,"D","F","N"]
[1,"Profile","Profilés","Profielen"]
[2,"Dimension in mm Stärke x Breite","Dimensions en mm épaisseur x largeur","Afmeting in mm dikte x breedte"]
[3,"Länge\n(m)","Longueur\n(m)","Lengte\n(m)"]
[4,"VPE Bund/Paket","Unité d'emballage par faisceau/paquet","Verpakking per bundel/pakket"]
[5,"Kommissions-preis (weniger als ein Paket)","Prix pour petite quantité (moins qu'un paquet)","Prijs kleine hoeveelheid (minder dan één pakket)"]
{"$rows_left_out":201}
{"sheet":"Änd. nächste Preisliste","index":15,"n_rows":3,"n_cols":1,"rows_kept":3,"cut":false,"hidden":false,"merged":[]}
["Änderungen für nächste Preisliste "]
[]
["Farbnamen Gross-Kleinschreibung"]

{"sheet":"MargenVersionen","index":16,"n_rows":21,"n_cols":11,"rows_kept":21,"cut":false,"hidden":false,"merged":[[17,0,17,6],[1,0,1,6],[3,0,3,6],[6,3,6,4],[5,5,5,6],[6,5,6,6],[5,1,5,2],[5,3,5,4]]}
[]
["Preisberechnung je nach Kundengruppe"]
[]
["Einstellungen zur Preisberechnung:"]
[]
[null,"Händlerpreisliste (A)",null,"Monteurspreisliste (B)",null,"xxx (C)",null,null,null,"Anzahl Seiten:",13]
{"$rows_left_out":16}
{"sheet":"Qualitätskriterien","index":17,"n_rows":54,"n_cols":1,"rows_kept":54,"cut":false,"hidden":false,"merged":[]}
[]
["Qualitätskriterien"]
[]
["In der Regel gilt die Sortierung auf 95% der Ware:"]
[]
["Qualitätskriterien Weisstanne:"]
{"$rows_left_out":48}